{"text_format":"1","workbook":"xlsx","n_sheets":5,"sheets":["Proposal and Operational Info","Guaranteed Heat Rate ","Pricing - Traditional Resources","Special Consideration(s)","2015 ELLEGSL RFP Econ_Rpt"],"not_rendered":{"charts":0,"images":0,"macros":0,"external_links":18,"defined_names":495,"comments":1,"pivot_tables":0},"unopened":[],"bounds":{"document_bytes":16777216,"sheet_cells":100000,"rows_first":2000,"rows_last":500,"rows_between":2000,"halvings":0,"cell_chars":16384,"cell_head_chars":4096},"cells_cut":0,"cells_raw":0,"read":"whole","date_system":"1900"}

{"sheet":"Proposal and Operational Info","index":0,"n_rows":85,"n_cols":16,"rows_kept":85,"cut":false,"hidden":false,"merged":[[74,0,76,0]]}
["Resource and Proposal Information","Input  (Drop down box/insert written details)","Description","Bidder Description (if needed)",null,null,null,null,null,null,10,"Developmental","PPA","Yes","Yes",0.95]
["Bidder ID",null,null,null,null,null,null,null,null,null,11,"Existing","Toll","No","No",0.96]
["Resource ID",null,null,null,null,null,null,null,null,null,12,null,"Acquisition",null,"N/A",0.97]
["Proposal ID",null,null,null,null,null,null,null,null,null,13,null,null,null,null,0.98]
["Is Proposal Mutually Exclusive to Another Proposal? (Y/N)",null,null,null,null,null,null,null,null,null,14,null,null,null,null,0.99]
["Mutually Exclusive Proposal ID",null,null,null,null,null,null,null,null,null,15,null,null,null,null,1]
["Resource Name",null,null,null,null,null,null,null,null,null,16]
["Resource Location [City, State]",null,null,null,null,null,null,null,null,null,17]
["Resource Type (Existing/Developmental)",null,null,null,null,null,null,null,null,null,18]
["If Developmetnal, is the Resource located WOTAB? (Y/N)",null,null,null,null,null,null,null,null,null,19]
["GPS Location",null,"Provide the GPS coordinates (latitude, longitude, elevation) of the Facility.",null,null,null,null,null,null,null,20]
["Footprint (acres, square ft)",null,"Provide the footprint of the Facility as well as the area of the entire property. "]
["Surroundings",null,"Describe the use of land adjacent to plant site in terms of zoning, purpose, and owners."]
["Proposal Type (PPA/Toll/Acquisition)"]
["Delivery Term for PPA & Tolls (10 - 20 Years)",null,"Minimum of 10 years, Maximum of 20 years.  "]
["Contract Start Date (PPA's and Tolls)/Acquisition Date (Acquisitions)",null,"Must be entered in MM/DD/YYYY\nBuyer prefers that the Delivery Term start at the beginning of the planning period recognized by the applicable Balancing Authority (June 1 under the current MISO Rules)"]
["Expected Commercial Operation Date (Developmental Resources)",null,"Enter the date on which the Facility is expected to have achieved substantial completion, satisified certain performance tests and be available for normal continuous operation"]
["Guaranteed Commercial Operation Date (Developmental Resources)",null,"Enter the date on which the Facility is guaranteed to have a achieved substantial completion, satisified certain performance tests and be available for normal continuous operation.  Must be within 180 of the expected Commercial Operation Date.  "]
["Nameplate Capacity of Entire Unit (ICAP MW)",null,"Specify the nameplate capacity of the Facility that is being proposed."]
["Is Buyer Allocated the Capacity of the Entire Unit? (Y/N)"]
{"$rows_left_out":66}
{"sheet":"Guaranteed Heat Rate ","index":1,"n_rows":16,"n_cols":5,"rows_kept":16,"cut":false,"hidden":false,"merged":[[10,2,10,3],[8,2,8,3],[0,1,0,4],[2,1,2,4],[3,1,3,4],[5,1,5,4],[9,2,9,3]]}
[null,"Resources are required to provide a Guaranteed Heat Rate "]
[]
[null,"The Guaranteed Heat Rate is expected to be based upon (and will be no greater than) the heat rate corresponding to Buyer's dispatch level for the season in which such dispatch occcurs.  "]
[null,"The Guaranteed Heat Rate is a blended heat rate for all MW included in the corresponding dispatch level. "]
[]
[null,"Complete the heat rate curves in the following table in one (1) MW increments from minimum dispatch level to maximum dispatch level in each configuration.  Repeat for additional configurations, if any.  Other than deadbands between configurations, each heat rate curve should reflect the entire operating range specified by Bidder in the applicable term sheet.  The Guaranteed Heat Rate should be a blended heat rate for all MW included in the corresponding dispatch level.  For example, if, for a dispatch level of 800 MW, the first 750 MW have a marginal heat rate of 7.000 MMBtu (HHV)/MWh and the other 50 MW have a Marginal Heat Rate of 10.000 MMBtu (HHV)/MWh, the “Guaranteed Heat Rate” for the dispatch level of 800 MW is 7.1875 MMBtu (HHV)/MWh = [(750 x 7.000) + (50 x 10.000)] / (750 + 50), and the Energy Price will be based on a total of 6,000 MMBtu (HHV) of gas = 800 x 7.500.  "]
[]
[null,"Temperatures:"]
[null,"Summer Months (June - August)","Reference Conditions of 97o Fahrenheit and 56% relative humidity"]
[null,"Winter Months (December-February)","Reference Conditions of 68o Fahrenheit and 74% relative humidity"]
[null,"Shoulder Season (March - May, September - November)","Reference Conditions of 82o Fahrenheit and 65% relative humidity"]
[]
[]
[]
[null,"Dispatch Level (MW)","Summer Season Heat Rate (MMBtu/MWh)","Winter Season Heat Rate (MMBtu/MWh)","Shoulder Season Heat Rate (MMBtu/MWh)"]
[null,"{insert MW increments beginning with minimum dispatch level}","{insert heat rate}","{insert heat rate}","{insert heat rate}"]

{"sheet":"Pricing - Traditional Resources","index":2,"n_rows":56,"n_cols":13,"rows_kept":56,"cut":false,"hidden":false,"merged":[[50,1,50,2],[51,1,51,2],[53,1,53,2],[55,1,55,2],[0,1,0,8],[22,1,22,2],[24,1,24,2],[25,1,25,2],[49,1,49,2]]}
[null,"Pricing - Traditional Resources",null,null,null,null,null,null,null,null,null,null,"Yes"]
[null,null,null,null,null,null,null,null,null,null,null,null,"No"]
[null,"Bidders Proposing a PPA should choose option (i), (ii) or (iii) and complete (iv) and (v) for pricing components [1] - [5]"]
[null,"Bidders Proposing a Toll should choose option (i), (ii) or (iii) for pricing components [1], [2] and [3]"]
[null,"Bidders Proposing an Acquisition should choose option (vi) for pricing component [6]"]
[]
[null,"All prices for option (iii) below should be provided on a calendar year (January - December) basis"]
[null,"Prior to completing the inputs below, please provide the Start Date and Delivery Term of the proposal requested in the Proposal and Operational Information Tab (Lines 14 and 15)"]
[]
[null,"[1] Enter a Capacity Rate, in $/kW-yr, that is either fixed for the term or defined annually or based on a Base Rate that is escalated by CPI or PPI.  All transmission related costs (requested in Section 2.4 of the RFP) should be included in the Capacity Rate. "]
[null,"      The Capacity Rate should be based on the UCAP Rating of the Resource"]
[null,"[2] Enter the Variable O&M Rate, expressed in $/MWh, that is fixed for the term or defined annually or based on a Base Rate that is escalated by CPI or PPI.  "]
[null,"[3] Enter the Start Charge, expressed as $/Completed Start, that is fixed for the term or defined annually or based on a Base Rate that is escalated by CPI or PPI"]
[null,"[4] Enter the fuel index and fuel adder (if applicable), expressed in $/MMBtu.  Bidder may propose to include, as a fuel adder, all or any portion of the actual amount incurred by Bidder for sales or "]
[null,"      use taxes and/or third party transportation.  Bidder may propose a fixed adder for the term or propose a mechanism/formula for the determination of the fuel adder.  "]
[null,"[5] Enter the Start Fuel Charge, expressed in MMBtu/Completed Start.  "]
[null,"[6] Provide the single fixed payment purchase price for the facility or the portion thereof allocated to Buyer"]
[]
[]
[]
{"$rows_left_out":37}
{"sheet":"Special Consideration(s)","index":3,"n_rows":30,"n_cols":1,"rows_kept":30,"cut":false,"hidden":false,"merged":[[1,0,1,1],[2,0,2,1],[0,0,0,1]]}
["Bidders not wishing to agree to a term or condition set forth or described in the RFP must identify the specific term or condition to"]
[" which Bidder takes exception and provide a reasonably complete and detailed explanation of Bidder’s position Submission of an exception does not"]
[" mean ESI will accept (and ESI is under no obligation to accept or agree to, in whole or in part) any exception noted below in any negotiation of a Definitive Agreement"]
[]
["Special Consideration #1"]
["Special Consideration #2"]
["Special Consideration #3"]
["Special Consideration #4"]
["Special Consideration #5"]
["Special Consideration #6"]
["Special Consideration #7"]
["Special Consideration #8"]
["Special Consideration #9"]
["Special Consideration #10"]
["Special Consideration #11"]
["Special Consideration #12"]
["Special Consideration #13"]
["Special Consideration #14"]
["Special Consideration #15"]
["Special Consideration #16"]
{"$rows_left_out":11}
{"sheet":"2015 ELLEGSL RFP Econ_Rpt","index":4,"n_rows":120,"n_cols":130,"rows_kept":120,"cut":false,"hidden":true,"merged":[]}
["2015 ELL/EGSL RFP ECONOMIC REPORT"]
[]
[]
[]
[]
[]
[]
[null,null,null,null,null,null,null,null,null,null,null,null,null,null,null,null,null,null,null,null,null,null,null,null,null,null,null,null,null,null,null,null,null,null,null,null,null,null,null,null,null,null,null,null,null,null,null,null,null,null,null,null,null,null,null,null,null,null,null,null,null,null,null,null,null,null,null,null,null,null,null,null,null,null,null,null,null,null,null,null,null,null,null,null,null,null,null,null,null,null,null,null,null,null,null,null,null,null,null,null,null,null,null,null,null,null,null,null,null,null,null,null,null,null,null,null,null,null,null,null,null,null,null,null,null,null,"Discuss with Admin Team wether we're accepting multifuel proposals",null,"Ask Admin Team if just HSC Fuel Index is being used, if so delete","Ask if Admin Team is including this in Bidder Submission Template"]
["Column # of Western RFP Economic Report",1,{"$f":"B9+1","v":2},{"$f":"C9+1","v":3},4,5,6,7,8,9,10,11,12,13,14,15,16,17,18,19,20,21,22,23,24,25,26,27,28,29,30,31,32,33,34,35,36,37,38,39,40,41,42,43,44,45,46,47,48,49,50,51,52,53,54,55,56,57,58,59,60,61,62,63,64,65,66,{"$f":"BO9+1","v":67},68,69,70,71,72,73,74,75,76,77,78,79,80,81,82,83,84,85,86,87,88,89,90,91,92,93,94,95,96,97,98,99,100,101,102,103,104,105,106,107,108,109,110,111,112,113,114,115,116,117,118,119,120,121,122,123,124,125,126,127,128,129]
[null,"RESOURCE_ID","PROPOSAL_ID","Bidder_ID","Product Package Type","Mutually Exclusive","Mutually Exclusive Proposal ID","GENERATION CONFIGURATION","EQUIP","ENVIRONMENTAL CONTROLS","Proposal Start Date  / Acquisition Date","Expected Commercial Operations Date","Guaranteed Commercial Operations Date","PPA & Tolling: Delivery Term","Capacity of Entire Unit?","PRIMEFUEL","Summer Maximum Base Capacity (ICAP)","Summer Maximum Supplemental Capacity (ICAP)","Acquisition: Purchase Price","Acquisition: FOM","Acquistion: VOM","Nameplate Capacity of Entire Unit (for Info)"," PPA & Tolling : Constant Capacity Rate "," PPA & Tolling : Annual Escalator for Constant Capacity Rate "," PPA & Tolling : Capacity Rate   - 2017"," PPA & Tolling : Capacity Rate   - 2018"," PPA & Tolling : Capacity Rate   - 2019"," PPA & Tolling : Capacity Rate   - 2020"," PPA & Tolling : Capacity Rate   - 2021"," PPA & Tolling : Capacity Rate   - 2022"," PPA & Tolling : Capacity Rate   - 2023"," PPA & Tolling : Capacity Rate   - 2024"," PPA & Tolling : Capacity Rate   - 2025"," PPA & Tolling : Capacity Rate   - 2026"," PPA & Tolling : Capacity Rate   - 2027"," PPA & Tolling : Capacity Rate   - 2028"," PPA & Tolling : Capacity Rate   - 2029"," PPA & Tolling : Capacity Rate   - 2030"," PPA & Tolling : Capacity Rate   - 2031"," PPA & Tolling : Capacity Rate   - 2032"," PPA & Tolling : Capacity Rate   - 2033"," PPA & Tolling : Capacity Rate   - 2034"," PPA & Tolling : Capacity Rate   - 2035"," PPA & Tolling : Capacity Rate   - 2036"," PPA & Tolling : Capacity Rate   - 2037"," PPA & Tolling : Capacity Rate   - 2038"," PPA & Tolling : Capacity Rate   - 2039"," PPA & Tolling : Capacity Rate   - 2040"," PPA & Tolling : Capacity Rate - 2041","PPA & Tolling : Base VOM","PPA & Tolling : Annual Escalator for VOM"," PPA & Tolling : VOM - 2017"," PPA & Tolling : VOM - 2018"," PPA & Tolling : VOM - 2019"," PPA & Tolling : VOM - 2020"," PPA & Tolling : VOM - 2021"," PPA & Tolling : VOM - 2022"," PPA & Tolling : VOM - 2023"," PPA & Tolling : VOM - 2024"," PPA & Tolling : VOM - 2025"," PPA & Tolling : VOM - 2026"," PPA & Tolling : VOM - 2027"," PPA & Tolling : VOM - 2028"," PPA & Tolling : VOM - 2029"," PPA & Tolling : VOM - 2030"," PPA & Tolling : VOM - 2031"," PPA & Tolling : VOM - 2032"," PPA & Tolling : VOM - 2033"," PPA & Tolling : VOM - 2034"," PPA & Tolling : VOM - 2035"," PPA & Tolling : VOM - 2036"," PPA & Tolling : VOM - 2037"," PPA & Tolling : VOM - 2038"," PPA & Tolling : VOM - 2039"," PPA & Tolling : VOM - 2040"," PPA & Tolling: VOM - 2041","PPA & Tolling: Base Start Charge","PPA & Tolling: Start Charge - Annual Escalator","PPA & Tolling : Start Charge - 2017","PPA & Tolling : Start Charge - 2018","PPA & Tolling : Start Charge - 2019","PPA & Tolling : Start Charge - 2020","PPA & Tolling : Start Charge - 2021","PPA & Tolling : Start Charge - 2022","PPA & Tolling : Start Charge - 2023","PPA & Tolling : Start Charge - 2024","PPA & Tolling : Start Charge - 2025","PPA & Tolling : Start Charge - 2026","PPA & Tolling : Start Charge - 2027","PPA & Tolling : Start Charge - 2028","PPA & Tolling : Start Charge - 2029","PPA & Tolling : Start Charge - 2030","PPA & Tolling : Start Charge - 2031","PPA & Tolling : Start Charge - 2032","PPA & Tolling : Start Charge - 2033","PPA & Tolling : Start Charge - 2034","PPA & Tolling : Start Charge - 2035","PPA & Tolling : Start Charge - 2036","PPA & Tolling : Start Charge - 2037","PPA & Tolling : Start Charge - 2038","PPA & Tolling : Start Charge - 2039","PPA & Tolling : Start Charge - 2040","PPA & Tolling : Start Charge - 2041","Acquisition: CO2 Emission Rate","Acquisition: SO2 Emission Rate","Acquisition: NOX Emission Rate","Average Annual Planned Maintenance","Summer and Winter Availability Factor","All other months Availability Factor","XEFORd","Average Heat Rate at Summer Maximum Permitted Dispatch Level","Supplemental Point Summer Heat Rate","PPA: Amount of Gas Required for a Complete Start - Cold Start","PPA: Amount of Gas Required for a Complete Start - Warm Start","PPA: Amount of Gas Required for a Complete Start - Hot Start","Acquisition: Total (NRIS+ERIS) Transmission Costs ","Special or Other Consideration #1","Special or Other Consideration #2","Special or Other Consideration #3","Special or Other Consideration #4","Special or Other Consideration #5","Special or Other Consideration #6","Special or Other Consideration #7","Special or Other Consideration #8","Special or Other Consideration #9","Special or Other Consideration #10","MULTIFUEL","SECFUEL","PPA: Fuel Index","Capacity Related Benefits"]
[null,null,null,null,null,null,null,null,null,null,null,null,null,"Year","Yes/No",null,"MW","MW","$","$/kW-Yr","$/MWh","MW","$/kW-Yr","PPI or CPI","$/kW-Yr","$/kW-Yr","$/kW-Yr","$/kW-Yr","$/kW-Yr","$/kW-Yr","$/kW-Yr","$/kW-Yr","$/kW-Yr","$/kW-Yr","$/kW-Yr","$/kW-Yr","$/kW-Yr","$/kW-Yr","$/kW-Yr","$/kW-Yr","$/kW-Yr","$/kW-Yr","$/kW-Yr","$/kW-Yr","$/kW-Yr","$/kW-Yr","$/kW-Yr","$/kW-Yr","$/kW-Yr","$/MWh","PPI or CPI","$/MWh","$/MWh","$/MWh","$/MWh","$/MWh","$/MWh","$/MWh","$/MWh","$/MWh","$/MWh","$/MWh","$/MWh","$/MWh","$/MWh","$/MWh","$/MWh","$/MWh","$/MWh","$/MWh","$/MWh","$/MWh","$/MWh","$/MWh","$/MWh","$/MWh","$/Start","PPI or CPI","$/Start","$/Start","$/Start","$/Start","$/Start","$/Start","$/Start","$/Start","$/Start","$/Start","$/Start","$/Start","$/Start","$/Start","$/Start","$/Start","$/Start","$/Start","$/Start","$/Start","$/Start","$/Start","$/Start","$/Start","$/Start","lb/MMBtu","lb/MMBtu","lb/MMBtu","hour","%","%","%","MMBtu/MWh","MMBtu/MWh","MMBtu","MMBtu","MMBtu","$"]
[1,{"$f":"'Proposal and Operational Info'!$B$3","v":0},{"$f":"'Proposal and Operational Info'!$B$4","v":0},{"$f":"'Proposal and Operational Info'!$B$2","v":0},{"$f":"'Proposal and Operational Info'!$B$14","v":0},{"$f":"'Proposal and Operational Info'!$B$5","v":0},{"$f":"'Proposal and Operational Info'!$B$6","v":0},{"$f":"'Proposal and Operational Info'!B36","v":0},{"$f":"'Proposal and Operational Info'!B35","v":0},{"$f":"'Proposal and Operational Info'!B37","v":0},{"$f":"'Proposal and Operational Info'!B16","v":"00:00:00"},{"$f":"'Proposal and Operational Info'!B17","v":"00:00:00"},{"$f":"'Proposal and Operational Info'!B18","v":"00:00:00"},{"$f":"'Proposal and Operational Info'!B15","v":0},{"$f":"'Proposal and Operational Info'!B20","v":0},"Natural Gas",{"$f":"IF('Proposal and Operational Info'!B49>0,'Proposal and Operational Info'!B49,'Proposal and Operational Info'!B22)","v":0},{"$f":"'Proposal and Operational Info'!B53","v":0},{"$f":"'Pricing - Traditional Resources'!I56","v":0},null,null,{"$f":"'Proposal and Operational Info'!B19","v":0},{"$f":"MAX('Pricing - Traditional Resources'!D23,'Pricing - Traditional Resources'!D25)","v":0},{"$f":"'Pricing - Traditional Resources'!D26","v":0},{"$f":"VLOOKUP(2017,'Pricing - Traditional Resources'!$C$28:$F$48,2,FALSE)","v":{"$error":"#N/A"}},{"$f":"VLOOKUP(2018,'Pricing - Traditional Resources'!$C$28:$F$48,2,FALSE)","v":{"$error":"#N/A"}},{"$f":"VLOOKUP(2019,'Pricing - Traditional Resources'!$C$28:$F$48,2,FALSE)","v":{"$error":"#N/A"}},{"$f":"VLOOKUP(2020,'Pricing - Traditional Resources'!$C$28:$F$48,2,FALSE)","v":{"$error":"#N/A"}},{"$f":"VLOOKUP(2021,'Pricing - Traditional Resources'!$C$28:$F$48,2,FALSE)","v":{"$error":"#N/A"}},{"$f":"VLOOKUP(2022,'Pricing - Traditional Resources'!$C$28:$F$48,2,FALSE)","v":{"$error":"#N/A"}},{"$f":"VLOOKUP(2023,'Pricing - Traditional Resources'!$C$28:$F$48,2,FALSE)","v":{"$error":"#N/A"}},{"$f":"VLOOKUP(2024,'Pricing - Traditional Resources'!$C$28:$F$48,2,FALSE)","v":{"$error":"#N/A"}},{"$f":"VLOOKUP(2025,'Pricing - Traditional Resources'!$C$28:$F$48,2,FALSE)","v":{"$error":"#N/A"}},{"$f":"VLOOKUP(2026,'Pricing - Traditional Resources'!$C$28:$F$48,2,FALSE)","v":{"$error":"#N/A"}},{"$f":"VLOOKUP(2027,'Pricing - Traditional Resources'!$C$28:$F$48,2,FALSE)","v":{"$error":"#N/A"}},{"$f":"VLOOKUP(2028,'Pricing - Traditional Resources'!$C$28:$F$48,2,FALSE)","v":{"$error":"#N/A"}},{"$f":"VLOOKUP(2029,'Pricing - Traditional Resources'!$C$28:$F$48,2,FALSE)","v":{"$error":"#N/A"}},{"$f":"VLOOKUP(2030,'Pricing - Traditional Resources'!$C$28:$F$48,2,FALSE)","v":{"$error":"#N/A"}},{"$f":"VLOOKUP(2031,'Pricing - Traditional Resources'!$C$28:$F$48,2,FALSE)","v":{"$error":"#N/A"}},{"$f":"VLOOKUP(2032,'Pricing - Traditional Resources'!$C$28:$F$48,2,FALSE)","v":{"$error":"#N/A"}},{"$f":"VLOOKUP(2033,'Pricing - Traditional Resources'!$C$28:$F$48,2,FALSE)","v":{"$error":"#N/A"}},{"$f":"VLOOKUP(2034,'Pricing - Traditional Resources'!$C$28:$F$48,2,FALSE)","v":{"$error":"#N/A"}},{"$f":"VLOOKUP(2035,'Pricing - Traditional Resources'!$C$28:$F$48,2,FALSE)","v":{"$error":"#N/A"}},{"$f":"VLOOKUP(2036,'Pricing - Traditional Resources'!$C$28:$F$48,2,FALSE)","v":{"$error":"#N/A"}},{"$f":"VLOOKUP(2037,'Pricing - Traditional Resources'!$C$28:$F$48,2,FALSE)","v":{"$error":"#N/A"}},{"$f":"VLOOKUP(2038,'Pricing - Traditional Resources'!$C$28:$F$48,2,FALSE)","v":{"$error":"#N/A"}},{"$f":"VLOOKUP(2039,'Pricing - Traditional Resources'!$C$28:$F$48,2,FALSE)","v":{"$error":"#N/A"}},{"$f":"VLOOKUP(2040,'Pricing - Traditional Resources'!$C$28:$F$48,2,FALSE)","v":{"$error":"#N/A"}},{"$f":"VLOOKUP(2041,'Pricing - Traditional Resources'!$C$28:$F$48,2,FALSE)","v":{"$error":"#N/A"}},{"$f":"MAX('Pricing - Traditional Resources'!E23,'Pricing - Traditional Resources'!E25)","v":0},{"$f":"'Pricing - Traditional Resources'!E26","v":0},{"$f":"VLOOKUP(2017,'Pricing - Traditional Resources'!$C$28:$F$48,4,FALSE)","v":{"$error":"#N/A"}},{"$f":"VLOOKUP(2018,'Pricing - Traditional Resources'!$C$28:$F$48,4,FALSE)","v":{"$error":"#N/A"}},{"$f":"VLOOKUP(2019,'Pricing - Traditional Resources'!$C$28:$F$48,4,FALSE)","v":{"$error":"#N/A"}},{"$f":"VLOOKUP(2020,'Pricing - Traditional Resources'!$C$28:$F$48,4,FALSE)","v":{"$error":"#N/A"}},{"$f":"VLOOKUP(2021,'Pricing - Traditional Resources'!$C$28:$F$48,4,FALSE)","v":{"$error":"#N/A"}},{"$f":"VLOOKUP(2022,'Pricing - Traditional Resources'!$C$28:$F$48,4,FALSE)","v":{"$error":"#N/A"}},{"$f":"VLOOKUP(2023,'Pricing - Traditional Resources'!$C$28:$F$48,4,FALSE)","v":{"$error":"#N/A"}},{"$f":"VLOOKUP(2024,'Pricing - Traditional Resources'!$C$28:$F$48,4,FALSE)","v":{"$error":"#N/A"}},{"$f":"VLOOKUP(2025,'Pricing - Traditional Resources'!$C$28:$F$48,4,FALSE)","v":{"$error":"#N/A"}},{"$f":"VLOOKUP(2026,'Pricing - Traditional Resources'!$C$28:$F$48,4,FALSE)","v":{"$error":"#N/A"}},{"$f":"VLOOKUP(2027,'Pricing - Traditional Resources'!$C$28:$F$48,4,FALSE)","v":{"$error":"#N/A"}},{"$f":"VLOOKUP(2028,'Pricing - Traditional Resources'!$C$28:$F$48,4,FALSE)","v":{"$error":"#N/A"}},{"$f":"VLOOKUP(2029,'Pricing - Traditional Resources'!$C$28:$F$48,4,FALSE)","v":{"$error":"#N/A"}},{"$f":"VLOOKUP(2030,'Pricing - Traditional Resources'!$C$28:$F$48,4,FALSE)","v":{"$error":"#N/A"}},{"$f":"VLOOKUP(2031,'Pricing - Traditional Resources'!$C$28:$F$48,4,FALSE)","v":{"$error":"#N/A"}},{"$f":"VLOOKUP(2032,'Pricing - Traditional Resources'!$C$28:$F$48,4,FALSE)","v":{"$error":"#N/A"}},{"$f":"VLOOKUP(2033,'Pricing - Traditional Resources'!$C$28:$F$48,4,FALSE)","v":{"$error":"#N/A"}},{"$f":"VLOOKUP(2034,'Pricing - Traditional Resources'!$C$28:$F$48,4,FALSE)","v":{"$error":"#N/A"}},{"$f":"VLOOKUP(2035,'Pricing - Traditional Resources'!$C$28:$F$48,4,FALSE)","v":{"$error":"#N/A"}},{"$f":"VLOOKUP(2036,'Pricing - Traditional Resources'!$C$28:$F$48,4,FALSE)","v":{"$error":"#N/A"}},{"$f":"VLOOKUP(2037,'Pricing - Traditional Resources'!$C$28:$F$48,4,FALSE)","v":{"$error":"#N/A"}},{"$f":"VLOOKUP(2038,'Pricing - Traditional Resources'!$C$28:$F$48,4,FALSE)","v":{"$error":"#N/A"}},{"$f":"VLOOKUP(2039,'Pricing - Traditional Resources'!$C$28:$F$48,4,FALSE)","v":{"$error":"#N/A"}},{"$f":"VLOOKUP(2040,'Pricing - Traditional Resources'!$C$28:$F$48,4,FALSE)","v":{"$error":"#N/A"}},{"$f":"VLOOKUP(2041,'Pricing - Traditional Resources'!$C$28:$F$48,4,FALSE)","v":{"$error":"#N/A"}},{"$f":"MAX('Pricing - Traditional Resources'!F23,'Pricing - Traditional Resources'!F25)","v":0},{"$f":"'Pricing - Traditional Resources'!F26","v":0},{"$f":"VLOOKUP(2017,'Pricing - Traditional Resources'!$C$28:$F$48,4,FALSE)","v":{"$error":"#N/A"}},{"$f":"VLOOKUP(2018,'Pricing - Traditional Resources'!$C$28:$F$48,4,FALSE)","v":{"$error":"#N/A"}},{"$f":"VLOOKUP(2019,'Pricing - Traditional Resources'!$C$28:$F$48,4,FALSE)","v":{"$error":"#N/A"}},{"$f":"VLOOKUP(2020,'Pricing - Traditional Resources'!$C$28:$F$48,4,FALSE)","v":{"$error":"#N/A"}},{"$f":"VLOOKUP(2021,'Pricing - Traditional Resources'!$C$28:$F$48,4,FALSE)","v":{"$error":"#N/A"}},{"$f":"VLOOKUP(2022,'Pricing - Traditional Resources'!$C$28:$F$48,4,FALSE)","v":{"$error":"#N/A"}},{"$f":"VLOOKUP(2023,'Pricing - Traditional Resources'!$C$28:$F$48,4,FALSE)","v":{"$error":"#N/A"}},{"$f":"VLOOKUP(2024,'Pricing - Traditional Resources'!$C$28:$F$48,4,FALSE)","v":{"$error":"#N/A"}},{"$f":"VLOOKUP(2025,'Pricing - Traditional Resources'!$C$28:$F$48,4,FALSE)","v":{"$error":"#N/A"}},{"$f":"VLOOKUP(2026,'Pricing - Traditional Resources'!$C$28:$F$48,4,FALSE)","v":{"$error":"#N/A"}},{"$f":"VLOOKUP(2027,'Pricing - Traditional Resources'!$C$28:$F$48,4,FALSE)","v":{"$error":"#N/A"}},{"$f":"VLOOKUP(2028,'Pricing - Traditional Resources'!$C$28:$F$48,4,FALSE)","v":{"$error":"#N/A"}},{"$f":"VLOOKUP(2029,'Pricing - Traditional Resources'!$C$28:$F$48,4,FALSE)","v":{"$error":"#N/A"}},{"$f":"VLOOKUP(2030,'Pricing - Traditional Resources'!$C$28:$F$48,4,FALSE)","v":{"$error":"#N/A"}},{"$f":"VLOOKUP(2031,'Pricing - Traditional Resources'!$C$28:$F$48,4,FALSE)","v":{"$error":"#N/A"}},{"$f":"VLOOKUP(2032,'Pricing - Traditional Resources'!$C$28:$F$48,4,FALSE)","v":{"$error":"#N/A"}},{"$f":"VLOOKUP(2033,'Pricing - Traditional Resources'!$C$28:$F$48,4,FALSE)","v":{"$error":"#N/A"}},{"$f":"VLOOKUP(2034,'Pricing - Traditional Resources'!$C$28:$F$48,4,FALSE)","v":{"$error":"#N/A"}},{"$f":"VLOOKUP(2035,'Pricing - Traditional Resources'!$C$28:$F$48,4,FALSE)","v":{"$error":"#N/A"}},{"$f":"VLOOKUP(2036,'Pricing - Traditional Resources'!$C$28:$F$48,4,FALSE)","v":{"$error":"#N/A"}},{"$f":"VLOOKUP(2037,'Pricing - Traditional Resources'!$C$28:$F$48,4,FALSE)","v":{"$error":"#N/A"}},{"$f":"VLOOKUP(2038,'Pricing - Traditional Resources'!$C$28:$F$48,4,FALSE)","v":{"$error":"#N/A"}},{"$f":"VLOOKUP(2039,'Pricing - Traditional Resources'!$C$28:$F$48,4,FALSE)","v":{"$error":"#N/A"}},{"$f":"VLOOKUP(2040,'Pricing - Traditional Resources'!$C$28:$F$48,4,FALSE)","v":{"$error":"#N/A"}},{"$f":"VLOOKUP(2041,'Pricing - Traditional Resources'!$C$28:$F$48,4,FALSE)","v":{"$error":"#N/A"}},{"$f":"'Proposal and Operational Info'!B68","v":0},{"$f":"'Proposal and Operational Info'!B69","v":0},{"$f":"'Proposal and Operational Info'!B70","v":0},{"$f":"'Proposal and Operational Info'!B73","v":0},{"$f":"'Proposal and Operational Info'!B71","v":0},{"$f":"'Proposal and Operational Info'!B72","v":0},{"$f":"'Proposal and Operational Info'!B74","v":0},{"$f":"'Proposal and Operational Info'!B50","v":0},{"$f":"'Proposal and Operational Info'!B54","v":0},{"$f":"'Proposal and Operational Info'!B63","v":0},{"$f":"'Proposal and Operational Info'!B61","v":0},{"$f":"'Proposal and Operational Info'!B59","v":0},{"$f":"'Proposal and Operational Info'!B30+'Proposal and Operational Info'!B32","v":0}]
[2]
[3]
[4]
[5]
[6]
[7]
[{"$f":"IF(C19>0,A18+1,\"\")","v":""}]
[""]
{"$rows_left_out":100}